Build failed in Jenkins: pgadmin4-master-python36 #599 - Mailing list pgadmin-hackers

From pgAdmin 4 Jenkins
Subject Build failed in Jenkins: pgadmin4-master-python36 #599
Date
Msg-id 1899681966.262.1525936758002.JavaMail.jenkins@jenkins.pgadmin.org
Whole thread Raw
In response to Build failed in Jenkins: pgadmin4-master-python36 #598  (pgAdmin 4 Jenkins <jenkins@pgadmin.org>)
Responses Jenkins build is back to normal : pgadmin4-master-python36 #600  (pgAdmin 4 Jenkins <jenkins@pgadmin.org>)
List pgadmin-hackers
See <https://jenkins.pgadmin.org/job/pgadmin4-master-python36/599/display/redirect?page=changes>

Changes:

[Ashesh Vashi] Change the order of the shims in the shims file.

[Ashesh Vashi] Using the latest version (v2.3.0) of jquery.event.drag to fix the

------------------------------------------
[...truncated 703.40 KB...]
HeadlessChrome 0.0.0 (Linux 0.0.0): Executed 327 of 531 SUCCESS (0 secs / 5.347 secs)
HeadlessChrome 0.0.0 (Linux 0.0.0): Executed 328 of 531 SUCCESS (0 secs / 5.35 secs)
HeadlessChrome 0.0.0 (Linux 0.0.0): Executed 329 of 531 SUCCESS (0 secs / 5.353 secs)
HeadlessChrome 0.0.0 (Linux 0.0.0): Executed 330 of 531 SUCCESS (0 secs / 5.356 secs)
HeadlessChrome 0.0.0 (Linux 0.0.0): Executed 331 of 531 SUCCESS (0 secs / 5.359 secs)
HeadlessChrome 0.0.0 (Linux 0.0.0): Executed 332 of 531 SUCCESS (0 secs / 5.363 secs)
HeadlessChrome 0.0.0 (Linux 0.0.0): Executed 333 of 531 SUCCESS (0 secs / 5.366 secs)
HeadlessChrome 0.0.0 (Linux 0.0.0): Executed 334 of 531 SUCCESS (0 secs / 5.37 secs)
HeadlessChrome 0.0.0 (Linux 0.0.0): Executed 335 of 531 SUCCESS (0 secs / 5.376 secs)
HeadlessChrome 0.0.0 (Linux 0.0.0): Executed 336 of 531 SUCCESS (0 secs / 5.38 secs)
HeadlessChrome 0.0.0 (Linux 0.0.0): Executed 337 of 531 SUCCESS (0 secs / 5.383 secs)
HeadlessChrome 0.0.0 (Linux 0.0.0): Executed 338 of 531 SUCCESS (0 secs / 5.386 secs)
HeadlessChrome 0.0.0 (Linux 0.0.0): Executed 339 of 531 SUCCESS (0 secs / 5.389 secs)
HeadlessChrome 0.0.0 (Linux 0.0.0): Executed 340 of 531 SUCCESS (0 secs / 5.392 secs)
HeadlessChrome 0.0.0 (Linux 0.0.0): Executed 341 of 531 SUCCESS (0 secs / 5.396 secs)
HeadlessChrome 0.0.0 (Linux 0.0.0): Executed 342 of 531 SUCCESS (0 secs / 5.399 secs)
HeadlessChrome 0.0.0 (Linux 0.0.0): Executed 343 of 531 SUCCESS (0 secs / 5.403 secs)
HeadlessChrome 0.0.0 (Linux 0.0.0): Executed 344 of 531 SUCCESS (0 secs / 5.409 secs)
HeadlessChrome 0.0.0 (Linux 0.0.0): Executed 345 of 531 SUCCESS (0 secs / 5.413 secs)
HeadlessChrome 0.0.0 (Linux 0.0.0): Executed 346 of 531 SUCCESS (0 secs / 5.416 secs)
HeadlessChrome 0.0.0 (Linux 0.0.0): Executed 347 of 531 SUCCESS (0 secs / 5.419 secs)
HeadlessChrome 0.0.0 (Linux 0.0.0): Executed 348 of 531 SUCCESS (0 secs / 5.422 secs)
HeadlessChrome 0.0.0 (Linux 0.0.0): Executed 349 of 531 SUCCESS (0 secs / 5.425 secs)
HeadlessChrome 0.0.0 (Linux 0.0.0): Executed 350 of 531 SUCCESS (0 secs / 5.429 secs)
HeadlessChrome 0.0.0 (Linux 0.0.0): Executed 351 of 531 SUCCESS (0 secs / 5.433 secs)
HeadlessChrome 0.0.0 (Linux 0.0.0): Executed 352 of 531 SUCCESS (0 secs / 5.439 secs)
HeadlessChrome 0.0.0 (Linux 0.0.0): Executed 353 of 531 SUCCESS (0 secs / 5.442 secs)
HeadlessChrome 0.0.0 (Linux 0.0.0): Executed 354 of 531 SUCCESS (0 secs / 5.445 secs)
HeadlessChrome 0.0.0 (Linux 0.0.0): Executed 355 of 531 SUCCESS (0 secs / 5.448 secs)
HeadlessChrome 0.0.0 (Linux 0.0.0): Executed 356 of 531 SUCCESS (0 secs / 5.452 secs)
HeadlessChrome 0.0.0 (Linux 0.0.0): Executed 357 of 531 SUCCESS (0 secs / 5.46 secs)
HeadlessChrome 0.0.0 (Linux 0.0.0): Executed 358 of 531 SUCCESS (0 secs / 5.469 secs)
HeadlessChrome 0.0.0 (Linux 0.0.0): Executed 359 of 531 SUCCESS (0 secs / 5.472 secs)
HeadlessChrome 0.0.0 (Linux 0.0.0): Executed 360 of 531 SUCCESS (0 secs / 5.476 secs)
HeadlessChrome 0.0.0 (Linux 0.0.0): Executed 361 of 531 SUCCESS (0 secs / 5.48 secs)
HeadlessChrome 0.0.0 (Linux 0.0.0): Executed 362 of 531 SUCCESS (0 secs / 5.483 secs)
HeadlessChrome 0.0.0 (Linux 0.0.0): Executed 363 of 531 SUCCESS (0 secs / 5.487 secs)
HeadlessChrome 0.0.0 (Linux 0.0.0): Executed 364 of 531 SUCCESS (0 secs / 5.492 secs)
HeadlessChrome 0.0.0 (Linux 0.0.0): Executed 365 of 531 SUCCESS (0 secs / 5.494 secs)
HeadlessChrome 0.0.0 (Linux 0.0.0): Executed 366 of 531 SUCCESS (0 secs / 5.497 secs)
HeadlessChrome 0.0.0 (Linux 0.0.0): Executed 367 of 531 SUCCESS (0 secs / 5.5 secs)
HeadlessChrome 0.0.0 (Linux 0.0.0): Executed 368 of 531 SUCCESS (0 secs / 5.503 secs)
HeadlessChrome 0.0.0 (Linux 0.0.0): Executed 369 of 531 SUCCESS (0 secs / 5.506 secs)
HeadlessChrome 0.0.0 (Linux 0.0.0): Executed 370 of 531 SUCCESS (0 secs / 5.51 secs)
HeadlessChrome 0.0.0 (Linux 0.0.0): Executed 371 of 531 SUCCESS (0 secs / 5.516 secs)
HeadlessChrome 0.0.0 (Linux 0.0.0): Executed 372 of 531 SUCCESS (0 secs / 5.521 secs)
HeadlessChrome 0.0.0 (Linux 0.0.0): Executed 373 of 531 SUCCESS (0 secs / 5.525 secs)
HeadlessChrome 0.0.0 (Linux 0.0.0): Executed 374 of 531 SUCCESS (0 secs / 5.529 secs)
HeadlessChrome 0.0.0 (Linux 0.0.0): Executed 375 of 531 SUCCESS (0 secs / 5.532 secs)
HeadlessChrome 0.0.0 (Linux 0.0.0): Executed 376 of 531 SUCCESS (0 secs / 5.535 secs)
HeadlessChrome 0.0.0 (Linux 0.0.0): Executed 377 of 531 SUCCESS (0 secs / 5.539 secs)
HeadlessChrome 0.0.0 (Linux 0.0.0): Executed 378 of 531 SUCCESS (0 secs / 5.542 secs)
HeadlessChrome 0.0.0 (Linux 0.0.0): Executed 379 of 531 SUCCESS (0 secs / 5.546 secs)
HeadlessChrome 0.0.0 (Linux 0.0.0): Executed 380 of 531 SUCCESS (0 secs / 5.55 secs)
HeadlessChrome 0.0.0 (Linux 0.0.0): Executed 381 of 531 SUCCESS (0 secs / 5.554 secs)
HeadlessChrome 0.0.0 (Linux 0.0.0): Executed 382 of 531 SUCCESS (0 secs / 5.557 secs)
HeadlessChrome 0.0.0 (Linux 0.0.0): Executed 383 of 531 SUCCESS (0 secs / 5.56 secs)
HeadlessChrome 0.0.0 (Linux 0.0.0): Executed 384 of 531 SUCCESS (0 secs / 5.563 secs)
HeadlessChrome 0.0.0 (Linux 0.0.0): Executed 385 of 531 SUCCESS (0 secs / 5.566 secs)
HeadlessChrome 0.0.0 (Linux 0.0.0): Executed 386 of 531 SUCCESS (0 secs / 5.57 secs)
HeadlessChrome 0.0.0 (Linux 0.0.0): Executed 387 of 531 SUCCESS (0 secs / 5.574 secs)
HeadlessChrome 0.0.0 (Linux 0.0.0) ExecuteQuery #execute when the SQL statement is not empty before the backend
requestdisables the run query button FAILED 
    TypeError: Cannot read property 'object' of undefined
        at compare (regression/javascript/sqleditor/execute_query_spec.js:15783:20)
        at UserContext.<anonymous> (regression/javascript/sqleditor/execute_query_spec.js:15260:30)
HeadlessChrome 0.0.0 (Linux 0.0.0): Executed 388 of 531 (1 FAILED) (0 secs / 5.577 secs)
HeadlessChrome 0.0.0 (Linux 0.0.0) ExecuteQuery #execute when the SQL statement is not empty before the backend request
disablesthe run query button FAILED 
    TypeError: Cannot read property 'object' of undefined
        at compare (regression/javascript/sqleditor/execute_query_spec.js:15783:20)
        at UserContext.<anonymous> (regression/javascript/sqleditor/execute_query_spec.js:15260:30)
HeadlessChrome 0.0.0 (Linux 0.0.0) ExecuteQuery #execute when the SQL statement is not empty before the backend
requestenable the cancel query button FAILED 
    TypeError: Cannot read property 'object' of undefined
        at compare (regression/javascript/sqleditor/execute_query_spec.js:15783:20)
        at UserContext.<anonymous> (regression/javascript/sqleditor/execute_query_spec.js:15266:30)
HeadlessChrome 0.0.0 (Linux 0.0.0): Executed 389 of 531 (2 FAILED) (0 secs / 5.579 secs)
HeadlessChrome 0.0.0 (Linux 0.0.0) ExecuteQuery #execute when the SQL statement is not empty before the backend request
enablethe cancel query button FAILED 
    TypeError: Cannot read property 'object' of undefined
        at compare (regression/javascript/sqleditor/execute_query_spec.js:15783:20)
        at UserContext.<anonymous> (regression/javascript/sqleditor/execute_query_spec.js:15266:30)
HeadlessChrome 0.0.0 (Linux 0.0.0): Executed 390 of 531 (2 FAILED) (0 secs / 5.581 secs)
HeadlessChrome 0.0.0 (Linux 0.0.0): Executed 391 of 531 (2 FAILED) (0 secs / 5.583 secs)
HeadlessChrome 0.0.0 (Linux 0.0.0): Executed 392 of 531 (2 FAILED) (0 secs / 5.59 secs)
HeadlessChrome 0.0.0 (Linux 0.0.0): Executed 393 of 531 (2 FAILED) (0 secs / 5.592 secs)
HeadlessChrome 0.0.0 (Linux 0.0.0): Executed 394 of 531 (2 FAILED) (0 secs / 5.593 secs)
HeadlessChrome 0.0.0 (Linux 0.0.0): Executed 395 of 531 (2 FAILED) (0 secs / 5.596 secs)
HeadlessChrome 0.0.0 (Linux 0.0.0): Executed 396 of 531 (2 FAILED) (0 secs / 5.6 secs)
HeadlessChrome 0.0.0 (Linux 0.0.0): Executed 397 of 531 (2 FAILED) (0 secs / 5.603 secs)
HeadlessChrome 0.0.0 (Linux 0.0.0): Executed 398 of 531 (2 FAILED) (0 secs / 5.606 secs)
HeadlessChrome 0.0.0 (Linux 0.0.0): Executed 399 of 531 (2 FAILED) (0 secs / 5.609 secs)
HeadlessChrome 0.0.0 (Linux 0.0.0): Executed 400 of 531 (2 FAILED) (0 secs / 5.613 secs)
HeadlessChrome 0.0.0 (Linux 0.0.0): Executed 401 of 531 (2 FAILED) (0 secs / 5.617 secs)
HeadlessChrome 0.0.0 (Linux 0.0.0) ExecuteQuery #execute when the SQL statement is not empty when HTTP return
200when backend informs that there was a problem with the query disable the cancel query button FAILED 
    Uncaught TypeError: Cannot read property 'object' of undefined thrown
HeadlessChrome 0.0.0 (Linux 0.0.0): Executed 402 of 531 (3 FAILED) (0 secs / 5.62 secs)
HeadlessChrome 0.0.0 (Linux 0.0.0) ExecuteQuery #execute when the SQL statement is not empty when HTTP return 200 when
backendinforms that there was a problem with the query disable the cancel query button FAILED 
    Uncaught TypeError: Cannot read property 'object' of undefined thrown
HeadlessChrome 0.0.0 (Linux 0.0.0): Executed 403 of 531 (3 FAILED) (0 secs / 5.623 secs)
HeadlessChrome 0.0.0 (Linux 0.0.0): Executed 404 of 531 (3 FAILED) (0 secs / 5.626 secs)
HeadlessChrome 0.0.0 (Linux 0.0.0): Executed 405 of 531 (3 FAILED) (0 secs / 5.629 secs)
HeadlessChrome 0.0.0 (Linux 0.0.0): Executed 406 of 531 (3 FAILED) (0 secs / 5.633 secs)
HeadlessChrome 0.0.0 (Linux 0.0.0): Executed 407 of 531 (3 FAILED) (0 secs / 5.636 secs)
HeadlessChrome 0.0.0 (Linux 0.0.0): Executed 408 of 531 (3 FAILED) (0 secs / 5.64 secs)
HeadlessChrome 0.0.0 (Linux 0.0.0): Executed 409 of 531 (3 FAILED) (0 secs / 5.646 secs)
HeadlessChrome 0.0.0 (Linux 0.0.0): Executed 410 of 531 (3 FAILED) (0 secs / 5.65 secs)
HeadlessChrome 0.0.0 (Linux 0.0.0): Executed 411 of 531 (3 FAILED) (0 secs / 5.654 secs)
HeadlessChrome 0.0.0 (Linux 0.0.0): Executed 412 of 531 (3 FAILED) (0 secs / 5.657 secs)
HeadlessChrome 0.0.0 (Linux 0.0.0): Executed 413 of 531 (3 FAILED) (0 secs / 5.66 secs)
HeadlessChrome 0.0.0 (Linux 0.0.0) ExecuteQuery #execute when the SQL statement is not empty when cannot reach
thePython Server should disable the cancel button FAILED 
    Uncaught TypeError: Cannot read property 'object' of undefined thrown
HeadlessChrome 0.0.0 (Linux 0.0.0): Executed 414 of 531 (4 FAILED) (0 secs / 5.664 secs)
HeadlessChrome 0.0.0 (Linux 0.0.0) ExecuteQuery #execute when the SQL statement is not empty when cannot reach the
PythonServer should disable the cancel button FAILED 
    Uncaught TypeError: Cannot read property 'object' of undefined thrown
HeadlessChrome 0.0.0 (Linux 0.0.0): Executed 415 of 531 (4 FAILED) (0 secs / 5.668 secs)
HeadlessChrome 0.0.0 (Linux 0.0.0): Executed 416 of 531 (4 FAILED) (0 secs / 5.675 secs)
HeadlessChrome 0.0.0 (Linux 0.0.0): Executed 417 of 531 (4 FAILED) (0 secs / 5.679 secs)
HeadlessChrome 0.0.0 (Linux 0.0.0): Executed 418 of 531 (4 FAILED) (0 secs / 5.693 secs)
HeadlessChrome 0.0.0 (Linux 0.0.0) ExecuteQuery #execute when the SQL statement is not empty when error is
returnedby the server when login is not required should disable the cancel button FAILED 
    Uncaught TypeError: Cannot read property 'object' of undefined thrown
HeadlessChrome 0.0.0 (Linux 0.0.0): Executed 419 of 531 (5 FAILED) (0 secs / 5.701 secs)
HeadlessChrome 0.0.0 (Linux 0.0.0) ExecuteQuery #execute when the SQL statement is not empty when error is returned by
theserver when login is not required should disable the cancel button FAILED 
    Uncaught TypeError: Cannot read property 'object' of undefined thrown
HeadlessChrome 0.0.0 (Linux 0.0.0): Executed 420 of 531 (5 FAILED) (0 secs / 5.704 secs)
HeadlessChrome 0.0.0 (Linux 0.0.0): Executed 421 of 531 (5 FAILED) (0 secs / 5.706 secs)
HeadlessChrome 0.0.0 (Linux 0.0.0): Executed 422 of 531 (5 FAILED) (0 secs / 5.712 secs)
HeadlessChrome 0.0.0 (Linux 0.0.0): Executed 423 of 531 (5 FAILED) (0 secs / 5.718 secs)
HeadlessChrome 0.0.0 (Linux 0.0.0): Executed 424 of 531 (5 FAILED) (0 secs / 5.723 secs)
HeadlessChrome 0.0.0 (Linux 0.0.0): Executed 425 of 531 (5 FAILED) (0 secs / 5.732 secs)
HeadlessChrome 0.0.0 (Linux 0.0.0) ExecuteQuery #execute when the SQL statement is not empty when error is
returnedby the server when login is required should disable the cancel button FAILED 
    Uncaught TypeError: Cannot read property 'object' of undefined thrown
HeadlessChrome 0.0.0 (Linux 0.0.0): Executed 426 of 531 (6 FAILED) (0 secs / 5.736 secs)
HeadlessChrome 0.0.0 (Linux 0.0.0) ExecuteQuery #execute when the SQL statement is not empty when error is returned by
theserver when login is required should disable the cancel button FAILED 
    Uncaught TypeError: Cannot read property 'object' of undefined thrown
HeadlessChrome 0.0.0 (Linux 0.0.0): Executed 427 of 531 (6 FAILED) (0 secs / 5.739 secs)
HeadlessChrome 0.0.0 (Linux 0.0.0): Executed 428 of 531 (6 FAILED) (0 secs / 5.745 secs)
HeadlessChrome 0.0.0 (Linux 0.0.0): Executed 429 of 531 (6 FAILED) (0 secs / 5.752 secs)
HeadlessChrome 0.0.0 (Linux 0.0.0): Executed 430 of 531 (6 FAILED) (0 secs / 5.756 secs)
HeadlessChrome 0.0.0 (Linux 0.0.0): Executed 431 of 531 (6 FAILED) (0 secs / 5.763 secs)
HeadlessChrome 0.0.0 (Linux 0.0.0): Executed 432 of 531 (6 FAILED) (0 secs / 5.768 secs)
HeadlessChrome 0.0.0 (Linux 0.0.0) ExecuteQuery #execute when the SQL statement is not empty when error is
returnedby the server when a new transaction is not required should disable the cancel button FAILED 
    Uncaught TypeError: Cannot read property 'object' of undefined thrown
HeadlessChrome 0.0.0 (Linux 0.0.0): Executed 433 of 531 (7 FAILED) (0 secs / 5.774 secs)
HeadlessChrome 0.0.0 (Linux 0.0.0) ExecuteQuery #execute when the SQL statement is not empty when error is returned by
theserver when a new transaction is not required should disable the cancel button FAILED 
    Uncaught TypeError: Cannot read property 'object' of undefined thrown
HeadlessChrome 0.0.0 (Linux 0.0.0): Executed 434 of 531 (7 FAILED) (0 secs / 5.778 secs)
HeadlessChrome 0.0.0 (Linux 0.0.0): Executed 435 of 531 (7 FAILED) (0 secs / 5.782 secs)
HeadlessChrome 0.0.0 (Linux 0.0.0): Executed 436 of 531 (7 FAILED) (0 secs / 5.786 secs)
HeadlessChrome 0.0.0 (Linux 0.0.0): Executed 437 of 531 (7 FAILED) (0 secs / 5.793 secs)
HeadlessChrome 0.0.0 (Linux 0.0.0): Executed 438 of 531 (7 FAILED) (0 secs / 5.798 secs)
HeadlessChrome 0.0.0 (Linux 0.0.0): Executed 439 of 531 (7 FAILED) (0 secs / 5.803 secs)
HeadlessChrome 0.0.0 (Linux 0.0.0): Executed 440 of 531 (7 FAILED) (0 secs / 5.81 secs)
HeadlessChrome 0.0.0 (Linux 0.0.0) ExecuteQuery #execute when the SQL statement is not empty when error is
returnedby the server when a new transaction is required should disable the cancel button FAILED 
    Uncaught TypeError: Cannot read property 'object' of undefined thrown
HeadlessChrome 0.0.0 (Linux 0.0.0): Executed 441 of 531 (8 FAILED) (0 secs / 5.815 secs)
HeadlessChrome 0.0.0 (Linux 0.0.0) ExecuteQuery #execute when the SQL statement is not empty when error is returned by
theserver when a new transaction is required should disable the cancel button FAILED 
    Uncaught TypeError: Cannot read property 'object' of undefined thrown
HeadlessChrome 0.0.0 (Linux 0.0.0): Executed 442 of 531 (8 FAILED) (0 secs / 5.819 secs)
HeadlessChrome 0.0.0 (Linux 0.0.0): Executed 443 of 531 (8 FAILED) (0 secs / 5.825 secs)
HeadlessChrome 0.0.0 (Linux 0.0.0): Executed 444 of 531 (8 FAILED) (0 secs / 5.828 secs)
HeadlessChrome 0.0.0 (Linux 0.0.0): Executed 445 of 531 (8 FAILED) (0 secs / 5.831 secs)
HeadlessChrome 0.0.0 (Linux 0.0.0): Executed 446 of 531 (8 FAILED) (0 secs / 5.834 secs)
HeadlessChrome 0.0.0 (Linux 0.0.0): Executed 447 of 531 (8 FAILED) (0 secs / 5.841 secs)
HeadlessChrome 0.0.0 (Linux 0.0.0): Executed 448 of 531 (8 FAILED) (0 secs / 5.845 secs)
HeadlessChrome 0.0.0 (Linux 0.0.0): Executed 449 of 531 (8 FAILED) (0 secs / 5.85 secs)
HeadlessChrome 0.0.0 (Linux 0.0.0): Executed 450 of 531 (8 FAILED) (0 secs / 5.857 secs)
HeadlessChrome 0.0.0 (Linux 0.0.0): Executed 451 of 531 (8 FAILED) (0 secs / 5.861 secs)
HeadlessChrome 0.0.0 (Linux 0.0.0): Executed 452 of 531 (8 FAILED) (0 secs / 5.863 secs)
HeadlessChrome 0.0.0 (Linux 0.0.0): Executed 453 of 531 (8 FAILED) (0 secs / 5.867 secs)
HeadlessChrome 0.0.0 (Linux 0.0.0): Executed 454 of 531 (8 FAILED) (0 secs / 5.87 secs)
HeadlessChrome 0.0.0 (Linux 0.0.0): Executed 455 of 531 (8 FAILED) (0 secs / 5.876 secs)
HeadlessChrome 0.0.0 (Linux 0.0.0): Executed 456 of 531 (8 FAILED) (0 secs / 5.891 secs)
HeadlessChrome 0.0.0 (Linux 0.0.0): Executed 457 of 531 (8 FAILED) (0 secs / 5.894 secs)
HeadlessChrome 0.0.0 (Linux 0.0.0): Executed 458 of 531 (8 FAILED) (0 secs / 5.896 secs)
HeadlessChrome 0.0.0 (Linux 0.0.0): Executed 459 of 531 (8 FAILED) (0 secs / 5.899 secs)
HeadlessChrome 0.0.0 (Linux 0.0.0): Executed 460 of 531 (8 FAILED) (0 secs / 5.901 secs)
HeadlessChrome 0.0.0 (Linux 0.0.0): Executed 461 of 531 (8 FAILED) (0 secs / 5.903 secs)
HeadlessChrome 0.0.0 (Linux 0.0.0): Executed 462 of 531 (8 FAILED) (0 secs / 5.905 secs)
HeadlessChrome 0.0.0 (Linux 0.0.0): Executed 463 of 531 (8 FAILED) (0 secs / 5.907 secs)
HeadlessChrome 0.0.0 (Linux 0.0.0): Executed 464 of 531 (8 FAILED) (0 secs / 5.909 secs)
HeadlessChrome 0.0.0 (Linux 0.0.0): Executed 465 of 531 (8 FAILED) (0 secs / 5.92 secs)
HeadlessChrome 0.0.0 (Linux 0.0.0): Executed 466 of 531 (8 FAILED) (0 secs / 5.924 secs)
HeadlessChrome 0.0.0 (Linux 0.0.0): Executed 467 of 531 (8 FAILED) (0 secs / 5.929 secs)
HeadlessChrome 0.0.0 (Linux 0.0.0): Executed 468 of 531 (8 FAILED) (0 secs / 5.935 secs)
HeadlessChrome 0.0.0 (Linux 0.0.0): Executed 469 of 531 (8 FAILED) (0 secs / 5.937 secs)
HeadlessChrome 0.0.0 (Linux 0.0.0): Executed 470 of 531 (8 FAILED) (0 secs / 5.938 secs)
HeadlessChrome 0.0.0 (Linux 0.0.0): Executed 471 of 531 (8 FAILED) (0 secs / 5.939 secs)
HeadlessChrome 0.0.0 (Linux 0.0.0): Executed 472 of 531 (8 FAILED) (0 secs / 5.941 secs)
HeadlessChrome 0.0.0 (Linux 0.0.0): Executed 473 of 531 (8 FAILED) (0 secs / 5.944 secs)
HeadlessChrome 0.0.0 (Linux 0.0.0): Executed 474 of 531 (8 FAILED) (0 secs / 5.946 secs)
HeadlessChrome 0.0.0 (Linux 0.0.0): Executed 475 of 531 (8 FAILED) (0 secs / 5.948 secs)
HeadlessChrome 0.0.0 (Linux 0.0.0): Executed 476 of 531 (8 FAILED) (0 secs / 5.95 secs)
HeadlessChrome 0.0.0 (Linux 0.0.0): Executed 477 of 531 (8 FAILED) (0 secs / 5.951 secs)
HeadlessChrome 0.0.0 (Linux 0.0.0): Executed 478 of 531 (8 FAILED) (0 secs / 5.952 secs)
HeadlessChrome 0.0.0 (Linux 0.0.0): Executed 479 of 531 (8 FAILED) (0 secs / 5.955 secs)
HeadlessChrome 0.0.0 (Linux 0.0.0): Executed 480 of 531 (8 FAILED) (0 secs / 5.958 secs)
HeadlessChrome 0.0.0 (Linux 0.0.0): Executed 481 of 531 (8 FAILED) (0 secs / 5.959 secs)
HeadlessChrome 0.0.0 (Linux 0.0.0): Executed 482 of 531 (8 FAILED) (0 secs / 5.961 secs)
HeadlessChrome 0.0.0 (Linux 0.0.0): Executed 483 of 531 (8 FAILED) (0 secs / 5.962 secs)
HeadlessChrome 0.0.0 (Linux 0.0.0): Executed 484 of 531 (8 FAILED) (0 secs / 5.965 secs)
HeadlessChrome 0.0.0 (Linux 0.0.0): Executed 485 of 531 (8 FAILED) (0 secs / 5.966 secs)
HeadlessChrome 0.0.0 (Linux 0.0.0): Executed 486 of 531 (8 FAILED) (0 secs / 5.968 secs)
HeadlessChrome 0.0.0 (Linux 0.0.0): Executed 487 of 531 (8 FAILED) (0 secs / 5.97 secs)
HeadlessChrome 0.0.0 (Linux 0.0.0): Executed 488 of 531 (8 FAILED) (0 secs / 5.973 secs)
HeadlessChrome 0.0.0 (Linux 0.0.0): Executed 489 of 531 (8 FAILED) (0 secs / 5.975 secs)
HeadlessChrome 0.0.0 (Linux 0.0.0): Executed 490 of 531 (8 FAILED) (0 secs / 5.977 secs)
HeadlessChrome 0.0.0 (Linux 0.0.0): Executed 491 of 531 (8 FAILED) (0 secs / 5.978 secs)
HeadlessChrome 0.0.0 (Linux 0.0.0): Executed 492 of 531 (8 FAILED) (0 secs / 5.98 secs)
HeadlessChrome 0.0.0 (Linux 0.0.0): Executed 493 of 531 (8 FAILED) (0 secs / 5.981 secs)
HeadlessChrome 0.0.0 (Linux 0.0.0): Executed 494 of 531 (8 FAILED) (0 secs / 5.983 secs)
HeadlessChrome 0.0.0 (Linux 0.0.0): Executed 495 of 531 (8 FAILED) (0 secs / 5.986 secs)
HeadlessChrome 0.0.0 (Linux 0.0.0): Executed 496 of 531 (8 FAILED) (0 secs / 5.99 secs)
HeadlessChrome 0.0.0 (Linux 0.0.0): Executed 497 of 531 (8 FAILED) (0 secs / 5.991 secs)
HeadlessChrome 0.0.0 (Linux 0.0.0): Executed 498 of 531 (8 FAILED) (0 secs / 5.993 secs)
HeadlessChrome 0.0.0 (Linux 0.0.0): Executed 499 of 531 (8 FAILED) (0 secs / 5.996 secs)
HeadlessChrome 0.0.0 (Linux 0.0.0): Executed 500 of 531 (8 FAILED) (0 secs / 5.998 secs)
HeadlessChrome 0.0.0 (Linux 0.0.0): Executed 501 of 531 (8 FAILED) (0 secs / 6 secs)
HeadlessChrome 0.0.0 (Linux 0.0.0): Executed 502 of 531 (8 FAILED) (0 secs / 6.003 secs)
HeadlessChrome 0.0.0 (Linux 0.0.0): Executed 503 of 531 (8 FAILED) (0 secs / 6.005 secs)
HeadlessChrome 0.0.0 (Linux 0.0.0): Executed 504 of 531 (8 FAILED) (0 secs / 6.007 secs)
HeadlessChrome 0.0.0 (Linux 0.0.0): Executed 505 of 531 (8 FAILED) (0 secs / 6.008 secs)
HeadlessChrome 0.0.0 (Linux 0.0.0): Executed 506 of 531 (8 FAILED) (0 secs / 6.009 secs)
HeadlessChrome 0.0.0 (Linux 0.0.0): Executed 507 of 531 (8 FAILED) (0 secs / 6.011 secs)
HeadlessChrome 0.0.0 (Linux 0.0.0): Executed 508 of 531 (8 FAILED) (0 secs / 6.014 secs)
HeadlessChrome 0.0.0 (Linux 0.0.0): Executed 509 of 531 (8 FAILED) (0 secs / 6.016 secs)
HeadlessChrome 0.0.0 (Linux 0.0.0): Executed 510 of 531 (8 FAILED) (0 secs / 6.018 secs)
HeadlessChrome 0.0.0 (Linux 0.0.0): Executed 511 of 531 (8 FAILED) (0 secs / 6.019 secs)
HeadlessChrome 0.0.0 (Linux 0.0.0): Executed 512 of 531 (8 FAILED) (0 secs / 6.02 secs)
HeadlessChrome 0.0.0 (Linux 0.0.0): Executed 513 of 531 (8 FAILED) (0 secs / 6.022 secs)
HeadlessChrome 0.0.0 (Linux 0.0.0): Executed 514 of 531 (8 FAILED) (0 secs / 6.024 secs)
HeadlessChrome 0.0.0 (Linux 0.0.0): Executed 515 of 531 (8 FAILED) (0 secs / 6.028 secs)
HeadlessChrome 0.0.0 (Linux 0.0.0): Executed 516 of 531 (8 FAILED) (0 secs / 6.03 secs)
HeadlessChrome 0.0.0 (Linux 0.0.0): Executed 517 of 531 (8 FAILED) (0 secs / 6.032 secs)
HeadlessChrome 0.0.0 (Linux 0.0.0): Executed 518 of 531 (8 FAILED) (0 secs / 6.033 secs)
HeadlessChrome 0.0.0 (Linux 0.0.0): Executed 519 of 531 (8 FAILED) (0 secs / 6.034 secs)
HeadlessChrome 0.0.0 (Linux 0.0.0): Executed 520 of 531 (8 FAILED) (0 secs / 6.036 secs)
HeadlessChrome 0.0.0 (Linux 0.0.0): Executed 521 of 531 (8 FAILED) (0 secs / 6.037 secs)
HeadlessChrome 0.0.0 (Linux 0.0.0): Executed 522 of 531 (8 FAILED) (0 secs / 6.038 secs)
HeadlessChrome 0.0.0 (Linux 0.0.0): Executed 523 of 531 (8 FAILED) (0 secs / 6.041 secs)
HeadlessChrome 0.0.0 (Linux 0.0.0): Executed 524 of 531 (8 FAILED) (0 secs / 6.043 secs)
HeadlessChrome 0.0.0 (Linux 0.0.0): Executed 525 of 531 (8 FAILED) (0 secs / 6.044 secs)
HeadlessChrome 0.0.0 (Linux 0.0.0): Executed 526 of 531 (8 FAILED) (0 secs / 6.045 secs)
HeadlessChrome 0.0.0 (Linux 0.0.0): Executed 527 of 531 (8 FAILED) (0 secs / 6.047 secs)
HeadlessChrome 0.0.0 (Linux 0.0.0): Executed 528 of 531 (8 FAILED) (0 secs / 6.048 secs)
HeadlessChrome 0.0.0 (Linux 0.0.0): Executed 529 of 531 (8 FAILED) (0 secs / 6.052 secs)
HeadlessChrome 0.0.0 (Linux 0.0.0): Executed 530 of 531 (8 FAILED) (0 secs / 6.053 secs)
HeadlessChrome 0.0.0 (Linux 0.0.0): Executed 531 of 531 (8 FAILED) (0 secs / 6.056 secs)
HeadlessChrome 0.0.0 (Linux 0.0.0): Executed 531 of 531 (8 FAILED) (6.285 secs / 6.056 secs)
ERROR: Error detected when running the Jasmine tests.
ERROR: Error detected when running the Jasmine tests.
Build step 'Execute shell' marked build as failure


pgadmin-hackers by date:

Previous
From: pgAdmin 4 Jenkins
Date:
Subject: Build failed in Jenkins: pgadmin4-master-python26 #736
Next
From: pgAdmin 4 Jenkins
Date:
Subject: Build failed in Jenkins: pgadmin4-master-python33 #606